{"text_format":"1","workbook":"xlsx","n_sheets":6,"sheets":["Instructions","Circuits","Devices","Data","Circuit Report","Device Report"],"not_rendered":{"charts":0,"images":6,"macros":1,"external_links":0,"defined_names":4,"comments":0,"pivot_tables":0},"unopened":[],"bounds":{"document_bytes":16777216,"sheet_cells":100000,"rows_first":2000,"rows_last":500,"rows_between":2000,"halvings":0,"cell_chars":16384,"cell_head_chars":4096},"cells_cut":0,"cells_raw":0,"read":"whole","date_system":"1900"}

{"sheet":"Instructions","index":0,"n_rows":103,"n_cols":10,"rows_kept":103,"cut":false,"hidden":false,"merged":[[92,1,92,10],[95,2,95,10],[98,2,98,10],[102,1,102,10],[71,1,72,10],[75,1,75,10],[78,1,78,10],[81,1,81,10],[84,1,84,10],[89,1,89,10],[68,1,68,10],[39,4,39,6],[40,4,40,6],[41,4,41,6],[42,4,42,6],[43,4,43,6],[44,4,44,6],[45,4,45,6],[48,2,48,10],[54,2,54,10],[57,2,57,10],[63,2,63,10],[38,4,38,6],[12,1,12,10],[17,1,17,10],[20,1,20,10],[23,1,23,10],[26,1,26,10],[30,1,30,10],[33,4,33,6],[34,4,34,6],[35,4,35,6],[36,4,36,6],[37,4,37,6],[11,1,11,2],[1,5,1,7],[3,5,3,7],[6,1,6,11],[8,1,8,2],[9,1,9,10]]}
[]
[null,null,null,null,null,"CommandCalc"]
[]
[null,null,"Version 8.0",null,null,"Instructions For Use"]
[]
[null,"General"]
[null,"CommandCalc is a spreadsheet tool that allows you to calculate worst case, (end of line) voltage drop on up to 20 notification appliance circuits at a time. The circuits may be numbered and named at the designers discretion. To assist in the selection of notification appliances, CommandCalc includes the alarm current draws of all 24 volt Gentex notification appliances, as well as allowing the designer to manually type in any non-Gentex devices they might be using.  "]
[]
[null,"Recommended Installation"]
[null,"The Gentex CommandCalc spreadsheet may be opened, edited, and saved, as is, in Microsoft Excel97 or later versions. For easier opening and saving of new (blank) projects the following is recommended: Open the Gentex CommandCalc Excel97 spreadsheet file and make any modifications to it that will be standard on all of your projects. For example, you may want to type in your company information in the \"Setup\" screen. Before entering any circuit information etc., save the file using File/Save As, and save it as a \"Template\" in your C:\\Program FIles\\Microsoft Office\\Templates directory. (This is the default directory when you select template as the file type you are saving as.) Template is a choice in the dropdown box titled \"Save As Type\" at the bottom of the Save As dialog box. By saving it as a template, you will always be able to open a blank CommandCalc project by selecting File/New from the Excel97 menu bar and clicking on Gentex CommandCalc. When saving CommandCalc projects you would save it as you would any other Excel file by selecting File/Save from the Excel menu bar, and saving it to your (My Documents) directory as a standard workbook. "]
[]
[]
[]
[null,null,null,null,"Circuit Summary Screen"]
[null,"Circuit Number","Circuit Name","Supply Voltage (VDC)","Alarm Current (Rt. Click)","Wire Type","Ohms / 1000 ft.","Length (Feet)","Total Resistance (Ohms)","Voltage Last Device"]
[null,1,"Lobby Strobes/Horns",24,1.21,"#14AWG Stranded",3.26,150,0.98,22.81]
[]
[null,"Each line of the \"Circuit Summary\" screen represents a single notification appliance circuit. Throughout the spreadsheet the color yellow is used to indicate which cells may be edited or changed. Gray colored cells contain formulas that may not be changed and are calculated automatically. The voltage drop percentage cell, changes color based on the value entered in \"Setup\" for the \"Voltage Drop Warning Threshold\". This cell is also calculated automatically and may not be changed."]
[]
[null,"Circuit Number"]
[null,"Circuit Number is intended to be used as a numerical identification of each circuit and may be selected two ways. You can enter any combination of letters/numbers manually for each circuit by typing in the appropriate cell, or you can click on the \"Setup\" button, click again on the \"Configure Auto Circuit Numbering\" button and have the spreadsheet automatically insert a numerical sequence of 1-20 circuit numbers starting with any number of your choosing. Please Note: Using Auto Circuit Numbering erases and reconfigures any circuit numbers you have entered manually into the spreadsheet."]
[]
[null,"Circuit Name"]
[null,"Circuit Name is a description of the circuit area and/or devices. Any combination of letters and numbers that fit into the cell may be entered."]
[]
[null,"Supply Voltage"]
[null,"Enter the supply voltage (VDC) for each circuit. If you wish to have all 20 circuits the same, you can enter a value in the \"Setup\" screen under \"Common Circuit Supply Voltage\" and that figure will automatically be entered into all 20 circuits Supply Voltage cells. Please Note: Entering a value into the \"Common Circuit Supply Voltage\" box in \"Setup\" will erase any figures you have entered manually in the \"Supply Voltage\" cells."]
[]
[]
[null,"Alarm Current",null,0]
[null,"The red borders around this cell indicate that you must <Right Click> in this cell to configure the notification appliances used on this circuit. Right clicking brings up the \"Circuit Devices\" section as shown below. Please note the spreadsheet will not allow you to proceed to the \"Circuit Devices\" screen without first entering at least a circuit number for that circuit."]
[]
[]
[null,null,null,null,"Circuit Number: 1"]
[null,null,null,null,"Circuit Name: Lobby Strobes/Horns"]
[null,null,null,"Qty.","Device",null,null,"Alarm Current (Each)","Alarm Current (Total)"]
[null,null,null,10,"Gentex GEC24-15/75 Horn/Strobe",null,null,7.8E-2,0.78]
[]
[]
[]
{"$rows_left_out":64}
{"sheet":"Circuits","index":1,"n_rows":33,"n_cols":11,"rows_kept":33,"cut":false,"hidden":false,"merged":[[19,9,19,10],[20,9,20,10],[21,9,21,10],[22,9,22,10],[23,9,23,10],[18,9,18,10],[7,9,7,10],[8,9,8,10],[9,9,9,10],[10,9,10,10],[11,9,11,10],[12,9,12,10],[13,9,13,10],[14,9,14,10],[15,9,15,10],[16,9,16,10],[17,9,17,10],[6,9,6,10],[0,4,0,6],[1,4,1,5],[3,9,3,10],[4,9,4,10],[5,9,5,10]]}
[null,null,null,null,"CommandCalc"]
[null,null,null,null,"Circuit Summary"]
[null,null,null,null,null,null,null,null,null,null,{"$f":"Data!B14/100","v":0.21568627450980393}]
[null,"Circuit Number","Circuit Name","Supply Voltage (VDC)","Alarm Current (Rt. Click)","Wire Type","Ohms / 1000 ft.","Length (Feet)","Total Resistance (Ohms)","Voltage Last Device"]
[null,null,null,null,{"$f":"Devices!E46","v":0},null,{"$f":"IF(F5=\"\",\"\",VLOOKUP(F5,$F$26:$G$33,2))","v":""},null,{"$f":"IF(H5>0,((H5*2)/1000)*G5,0)","v":0},{"$f":"D5-(I5*E5)","v":0}]
[null,"",null,null,{"$f":"Devices!E76","v":0},null,"",null,0,{"$f":"D6-(I6*E6)","v":0}]
[null,"",null,null,{"$f":"Devices!E106","v":0},null,"",null,0,{"$f":"D7-(I7*E7)","v":0}]
[null,"",null,null,{"$f":"Devices!E136","v":0},null,"",null,0,0]
[null,"",null,null,{"$f":"Devices!E166","v":0},null,"",null,0,0]
[null,"",null,null,{"$f":"Devices!E196","v":0},null,"",null,0,0]
[null,"",null,null,{"$f":"Devices!E226","v":0},null,"",null,0,0]
[null,"",null,null,{"$f":"Devices!E256","v":0},null,"",null,0,0]
[null,"",null,null,{"$f":"Devices!E286","v":0},null,"",null,0,0]
[null,"",null,null,{"$f":"Devices!E316","v":0},null,"",null,0,0]
[null,"",null,null,{"$f":"Devices!E346","v":0},null,"",null,0,0]
[null,"",null,null,{"$f":"Devices!E376","v":0},null,"",null,0,0]
[null,"",null,null,{"$f":"Devices!E406","v":0},null,"",null,0,0]
[null,"",null,null,{"$f":"Devices!E436","v":0},null,"",null,0,0]
[null,"",null,null,{"$f":"Devices!E466","v":0},null,"",null,0,0]
[null,"",null,null,{"$f":"Devices!E496","v":0},null,"",null,0,0]
[null,"",null,null,{"$f":"Devices!E526","v":0},null,"",null,0,0]
[null,"",null,null,{"$f":"Devices!E556","v":0},null,"",null,0,0]
[null,"",null,null,{"$f":"Devices!E586","v":0},null,"",null,0,0]
[null,"",null,null,{"$f":"Devices!E616","v":0},null,"",null,0,0]
[]
[null,null,null,20.399999999999999,"(24V System)","#12AWG Solid",2.0099999999999998]
[null,null,null,10.199999999999999,"(12V System)","#12AWG Stranded",2.0499999999999998,null,20.399999999999999]
[null,null,null,null,null,"#14AWG Solid",3.19,null,10.199999999999999]
[null,null,null,null,null,"#14AWG Stranded",3.26]
[null,null,null,null,null,"#16AWG Solid",5.08]
[null,null,null,null,null,"#16AWG Stranded",5.29]
[null,null,null,null,null,"#18AWG Solid",8.08]
[null,null,null,null,null,"#18AWG Stranded",8.4499999999999993]

{"sheet":"Devices","index":2,"n_rows":876,"n_cols":5,"rows_kept":876,"cut":false,"hidden":true,"merged":[]}
[]
[]
[]
[]
[]
[]
[]
[]
[]
[]
[]
[]
[]
[]
[]
[]
[]
[]
[]
[]
[]
[]
[]
[]
[]
[]
[]
[]
[]
[]
[]
[]
[null,null,{"$f":"\"Circuit Number: \"&Circuits!B5","v":"Circuit Number: "}]
[null,null,{"$f":"\"Circuit Name: \"&Circuits!C5","v":"Circuit Name: "}]
[null,"Qty","Devices","Alarm Current (Each)","Alarm Current (Total)"]
[null,null,null,{"$f":"IF(C36<>\"\",VLOOKUP(C36,$C$700:$D$876,2),0)","v":0},{"$f":"IF(B36>0,(B36*D36),0)","v":0}]
[null,null,null,{"$f":"IF(C37<>\"\",VLOOKUP(C37,$C$700:$D$876,2),0)","v":0},0]
[null,null,null,0,0]
[null,null,null,0,0]
[null,null,null,0,0]
{"$rows_left_out":837}
{"sheet":"Data","index":3,"n_rows":14,"n_cols":2,"rows_kept":14,"cut":false,"hidden":true,"merged":[]}
["Project Name:"]
["Project Number:"]
["Date:"]
["Designer:"]
[]
["Company Name:"]
["Address1:"]
["City:"]
["State:"]
["Zip:"]
["Phone:"]
["Fax:"]
[]
["Voltage Drop Warning Threshold:",21.568627450980394]

{"sheet":"Circuit Report","index":4,"n_rows":34,"n_cols":9,"rows_kept":34,"cut":false,"hidden":true,"merged":[[5,3,6,4],[0,0,0,1],[1,0,1,1],[2,0,2,1],[3,0,3,1],[4,0,4,1]]}
[{"$f":"Data!B6","v":0}]
[{"$f":"Data!B7","v":0},null,null,null,null,{"$f":"\"Project Name: \"&Data!B1","v":"Project Name: "}]
[{"$f":"Data!B8&\", \"&Data!B9&\", \"&Data!B10","v":", , "},null,null,null,null,{"$f":"\"Project Number: \"&Data!B2","v":"Project Number: "}]
[{"$f":"Data!B11&\" Phone\"","v":" Phone"},null,null,null,null,{"$f":"\"Designer: \"&Data!B4","v":"Designer: "}]
[{"$f":"Data!B12&\" Fax\"","v":" Fax"},null,null,null,null,{"$f":"\"Date: \"&Data!B3","v":"Date: "}]
[null,null,null,"Circuit Summary"]
[]
["Circuit Number","Circuit Name","Supply Voltage (VDC)","Alarm Current","Wire Type","Ohms / 1000 ft.","Length (Feet)","Total Resistance (Ohms)","Voltage Last Device"]
[{"$f":"IF(Circuits!B5<>\"\",Circuits!B5, \"\")","v":""},{"$f":"Circuits!C5","v":0},{"$f":"Circuits!D5","v":0},{"$f":"Circuits!E5","v":0},{"$f":"Circuits!F5","v":0},{"$f":"Circuits!G5","v":""},{"$f":"Circuits!H5","v":0},{"$f":"Circuits!I5","v":0},{"$f":"Circuits!J5","v":0}]
[{"$f":"IF(Circuits!B6<>\"\",Circuits!B6, \"\")","v":""},{"$f":"Circuits!C6","v":0},{"$f":"Circuits!D6","v":0},{"$f":"Circuits!E6","v":0},{"$f":"Circuits!F6","v":0},{"$f":"Circuits!G6","v":""},{"$f":"Circuits!H6","v":0},{"$f":"Circuits!I6","v":0},{"$f":"Circuits!J6","v":0}]
[{"$f":"IF(Circuits!B7<>\"\",Circuits!B7, \"\")","v":""},{"$f":"Circuits!C7","v":0},{"$f":"Circuits!D7","v":0},{"$f":"Circuits!E7","v":0},{"$f":"Circuits!F7","v":0},{"$f":"Circuits!G7","v":""},{"$f":"Circuits!H7","v":0},{"$f":"Circuits!I7","v":0},{"$f":"Circuits!J7","v":0}]
[{"$f":"IF(Circuits!B8<>\"\",Circuits!B8, \"\")","v":""},{"$f":"Circuits!C8","v":0},{"$f":"Circuits!D8","v":0},{"$f":"Circuits!E8","v":0},{"$f":"Circuits!F8","v":0},{"$f":"Circuits!G8","v":""},{"$f":"Circuits!H8","v":0},{"$f":"Circuits!I8","v":0},{"$f":"Circuits!J8","v":0}]
[{"$f":"IF(Circuits!B9<>\"\",Circuits!B9, \"\")","v":""},{"$f":"Circuits!C9","v":0},{"$f":"Circuits!D9","v":0},{"$f":"Circuits!E9","v":0},{"$f":"Circuits!F9","v":0},{"$f":"Circuits!G9","v":""},{"$f":"Circuits!H9","v":0},{"$f":"Circuits!I9","v":0},{"$f":"Circuits!J9","v":0}]
[{"$f":"IF(Circuits!B10<>\"\",Circuits!B10, \"\")","v":""},{"$f":"Circuits!C10","v":0},{"$f":"Circuits!D10","v":0},{"$f":"Circuits!E10","v":0},{"$f":"Circuits!F10","v":0},{"$f":"Circuits!G10","v":""},{"$f":"Circuits!H10","v":0},{"$f":"Circuits!I10","v":0},{"$f":"Circuits!J10","v":0}]
[{"$f":"IF(Circuits!B11<>\"\",Circuits!B11, \"\")","v":""},{"$f":"Circuits!C11","v":0},{"$f":"Circuits!D11","v":0},{"$f":"Circuits!E11","v":0},{"$f":"Circuits!F11","v":0},{"$f":"Circuits!G11","v":""},{"$f":"Circuits!H11","v":0},{"$f":"Circuits!I11","v":0},{"$f":"Circuits!J11","v":0}]
[{"$f":"IF(Circuits!B12<>\"\",Circuits!B12, \"\")","v":""},{"$f":"Circuits!C12","v":0},{"$f":"Circuits!D12","v":0},{"$f":"Circuits!E12","v":0},{"$f":"Circuits!F12","v":0},{"$f":"Circuits!G12","v":""},{"$f":"Circuits!H12","v":0},{"$f":"Circuits!I12","v":0},{"$f":"Circuits!J12","v":0}]
[{"$f":"IF(Circuits!B13<>\"\",Circuits!B13, \"\")","v":""},{"$f":"Circuits!C13","v":0},{"$f":"Circuits!D13","v":0},{"$f":"Circuits!E13","v":0},{"$f":"Circuits!F13","v":0},{"$f":"Circuits!G13","v":""},{"$f":"Circuits!H13","v":0},{"$f":"Circuits!I13","v":0},{"$f":"Circuits!J13","v":0}]
[{"$f":"IF(Circuits!B14<>\"\",Circuits!B14, \"\")","v":""},{"$f":"Circuits!C14","v":0},{"$f":"Circuits!D14","v":0},{"$f":"Circuits!E14","v":0},{"$f":"Circuits!F14","v":0},{"$f":"Circuits!G14","v":""},{"$f":"Circuits!H14","v":0},{"$f":"Circuits!I14","v":0},{"$f":"Circuits!J14","v":0}]
[{"$f":"IF(Circuits!B15<>\"\",Circuits!B15, \"\")","v":""},{"$f":"Circuits!C15","v":0},{"$f":"Circuits!D15","v":0},{"$f":"Circuits!E15","v":0},{"$f":"Circuits!F15","v":0},{"$f":"Circuits!G15","v":""},{"$f":"Circuits!H15","v":0},{"$f":"Circuits!I15","v":0},{"$f":"Circuits!J15","v":0}]
[{"$f":"IF(Circuits!B16<>\"\",Circuits!B16, \"\")","v":""},{"$f":"Circuits!C16","v":0},{"$f":"Circuits!D16","v":0},{"$f":"Circuits!E16","v":0},{"$f":"Circuits!F16","v":0},{"$f":"Circuits!G16","v":""},{"$f":"Circuits!H16","v":0},{"$f":"Circuits!I16","v":0},{"$f":"Circuits!J16","v":0}]
[{"$f":"IF(Circuits!B17<>\"\",Circuits!B17, \"\")","v":""},{"$f":"Circuits!C17","v":0},{"$f":"Circuits!D17","v":0},{"$f":"Circuits!E17","v":0},{"$f":"Circuits!F17","v":0},{"$f":"Circuits!G17","v":""},{"$f":"Circuits!H17","v":0},{"$f":"Circuits!I17","v":0},{"$f":"Circuits!J17","v":0}]
[{"$f":"IF(Circuits!B18<>\"\",Circuits!B18, \"\")","v":""},{"$f":"Circuits!C18","v":0},{"$f":"Circuits!D18","v":0},{"$f":"Circuits!E18","v":0},{"$f":"Circuits!F18","v":0},{"$f":"Circuits!G18","v":""},{"$f":"Circuits!H18","v":0},{"$f":"Circuits!I18","v":0},{"$f":"Circuits!J18","v":0}]
[{"$f":"IF(Circuits!B19<>\"\",Circuits!B19, \"\")","v":""},{"$f":"Circuits!C19","v":0},{"$f":"Circuits!D19","v":0},{"$f":"Circuits!E19","v":0},{"$f":"Circuits!F19","v":0},{"$f":"Circuits!G19","v":""},{"$f":"Circuits!H19","v":0},{"$f":"Circuits!I19","v":0},{"$f":"Circuits!J19","v":0}]
[{"$f":"IF(Circuits!B20<>\"\",Circuits!B20, \"\")","v":""},{"$f":"Circuits!C20","v":0},{"$f":"Circuits!D20","v":0},{"$f":"Circuits!E20","v":0},{"$f":"Circuits!F20","v":0},{"$f":"Circuits!G20","v":""},{"$f":"Circuits!H20","v":0},{"$f":"Circuits!I20","v":0},{"$f":"Circuits!J20","v":0}]
[{"$f":"IF(Circuits!B21<>\"\",Circuits!B21, \"\")","v":""},{"$f":"Circuits!C21","v":0},{"$f":"Circuits!D21","v":0},{"$f":"Circuits!E21","v":0},{"$f":"Circuits!F21","v":0},{"$f":"Circuits!G21","v":""},{"$f":"Circuits!H21","v":0},{"$f":"Circuits!I21","v":0},{"$f":"Circuits!J21","v":0}]
[{"$f":"IF(Circuits!B22<>\"\",Circuits!B22, \"\")","v":""},{"$f":"Circuits!C22","v":0},{"$f":"Circuits!D22","v":0},{"$f":"Circuits!E22","v":0},{"$f":"Circuits!F22","v":0},{"$f":"Circuits!G22","v":""},{"$f":"Circuits!H22","v":0},{"$f":"Circuits!I22","v":0},{"$f":"Circuits!J22","v":0}]
[{"$f":"IF(Circuits!B23<>\"\",Circuits!B23, \"\")","v":""},{"$f":"Circuits!C23","v":0},{"$f":"Circuits!D23","v":0},{"$f":"Circuits!E23","v":0},{"$f":"Circuits!F23","v":0},{"$f":"Circuits!G23","v":""},{"$f":"Circuits!H23","v":0},{"$f":"Circuits!I23","v":0},{"$f":"Circuits!J23","v":0}]
[{"$f":"IF(Circuits!B24<>\"\",Circuits!B24, \"\")","v":""},{"$f":"Circuits!C24","v":0},{"$f":"Circuits!D24","v":0},{"$f":"Circuits!E24","v":0},{"$f":"Circuits!F24","v":0},{"$f":"Circuits!G24","v":""},{"$f":"Circuits!H24","v":0},{"$f":"Circuits!I24","v":0},{"$f":"Circuits!J24","v":0}]
[]
["Notes:"]
["1.) Wire resistance is taken from Chapter 9 Table 8 of the National Electric Code (NFPA70). Resistance shown is calculated at 75 degrees Centigrade (167 degrees Farenheit)"]
["2.) Formula used for calculation:",null,"Total Resistance = (Length x 2) / 1000 x Ohms Per 1000 Ft."]
[null,null,"Voltage Last Device = Supply Voltage - (Alarm Current x Total Resistance)"]
["3.) Calculations are based on average current draw of devices using a regulated power supply only."]

{"sheet":"Device Report","index":5,"n_rows":247,"n_cols":6,"rows_kept":247,"cut":false,"hidden":true,"merged":[[5,3,6,3],[0,0,0,1],[1,0,1,1],[2,0,2,1],[3,0,3,1],[4,0,4,1]]}
[{"$f":"Data!B6","v":0}]
[{"$f":"Data!B7","v":0},null,null,{"$f":"\"Project Name: \"&Data!B1","v":"Project Name: "}]
[{"$f":"Data!B8&\", \"&Data!B9&\", \"&Data!B10","v":", , "},null,null,{"$f":"\"Project Number: \"&Data!B2","v":"Project Number: "}]
[{"$f":"Data!B11&\" Phone\"","v":" Phone"},null,null,{"$f":"\"Designer: \"&Data!B4","v":"Designer: "}]
[{"$f":"Data!B12&\" Fax\"","v":" Fax"},null,null,{"$f":"\"Date: \"&Data!B3","v":"Date: "}]
[null,null,null,"Circuit Devices"]
[]
["Circuit Number","Circuit Name","Qty.","Device","Current Each (Amps)","Current Total (Amps)"]
[{"$f":"Circuits!B5","v":0},{"$f":"Circuits!C5","v":0},{"$f":"Devices!B36","v":0},{"$f":"Devices!C36","v":0},{"$f":"Devices!D36","v":0},{"$f":"Devices!E36","v":0}]
[{"$f":"IF(F9>0,\"\",Circuits!B5)","v":0},{"$f":"IF(F9>0,\"\",Circuits!$C$5)","v":0},{"$f":"Devices!B37","v":0},{"$f":"Devices!C37","v":0},{"$f":"Devices!D37","v":0},{"$f":"Devices!E37","v":0}]
[{"$f":"IF(SUM(F9:F10)>0,\"\",Circuits!$B$5)","v":0},{"$f":"IF(SUM(F9:F10)>0,\"\",Circuits!$C$5)","v":0},{"$f":"Devices!B38","v":0},{"$f":"Devices!C38","v":0},{"$f":"Devices!D38","v":0},{"$f":"Devices!E38","v":0}]
[{"$f":"IF(SUM(F9:F11)>0,\"\",Circuits!$B$5)","v":0},{"$f":"IF(SUM(F9:F11)>0,\"\",Circuits!$C$5)","v":0},{"$f":"Devices!B39","v":0},{"$f":"Devices!C39","v":0},{"$f":"Devices!D39","v":0},{"$f":"Devices!E39","v":0}]
[{"$f":"IF(SUM(F9:F12)>0,\"\",Circuits!$B$5)","v":0},{"$f":"IF(SUM(F9:F12)>0,\"\",Circuits!$C$5)","v":0},{"$f":"Devices!B40","v":0},{"$f":"Devices!C40","v":0},{"$f":"Devices!D40","v":0},{"$f":"Devices!E40","v":0}]
[{"$f":"IF(SUM(F9:F13)>0,\"\",Circuits!$B$5)","v":0},{"$f":"IF(SUM(F9:F13)>0,\"\",Circuits!$C$5)","v":0},{"$f":"Devices!B41","v":0},{"$f":"Devices!C41","v":0},{"$f":"Devices!D41","v":0},{"$f":"Devices!E41","v":0}]
[{"$f":"IF(SUM(F9:F14)>0,\"\",Circuits!$B$5)","v":0},{"$f":"IF(SUM(F9:F14)>0,\"\",Circuits!$C$5)","v":0},{"$f":"Devices!B42","v":0},{"$f":"Devices!C42","v":0},{"$f":"Devices!D42","v":0},{"$f":"Devices!E42","v":0}]
[{"$f":"IF(SUM(F9:F15)>0,\"\",Circuits!$B$5)","v":0},{"$f":"IF(SUM(F9:F15)>0,\"\",Circuits!$C$5)","v":0},{"$f":"Devices!B43","v":0},{"$f":"Devices!C43","v":0},{"$f":"Devices!D43","v":0},{"$f":"Devices!E43","v":0}]
[{"$f":"IF(SUM(F9:F16)>0,\"\",Circuits!$B$5)","v":0},{"$f":"IF(SUM(F9:F16)>0,\"\",Circuits!$C$5)","v":0},{"$f":"Devices!B44","v":0},{"$f":"Devices!C44","v":0},{"$f":"Devices!D44","v":0},{"$f":"Devices!E44","v":0}]
[{"$f":"IF(SUM(F9:F17)>0,\"\",Circuits!$B$5)","v":0},{"$f":"IF(SUM(F9:F17)>0,\"\",Circuits!$C$5)","v":0},{"$f":"Devices!B45","v":0},{"$f":"Devices!C45","v":0},{"$f":"Devices!D45","v":0},{"$f":"Devices!E45","v":0}]
[null,null,null,null,"Total Circuit Current:",{"$f":"Circuits!E5","v":0}]
[]
[{"$f":"Circuits!B6","v":""},{"$f":"Circuits!C6","v":0},{"$f":"Devices!B66","v":0},{"$f":"Devices!C66","v":0},{"$f":"Devices!D66","v":0},{"$f":"Devices!E66","v":0}]
[{"$f":"IF(F21>0,\"\",Circuits!B6)","v":""},{"$f":"IF(F21>0,\"\",Circuits!$C$6)","v":0},{"$f":"Devices!B67","v":0},{"$f":"Devices!C67","v":0},{"$f":"Devices!D67","v":0},{"$f":"Devices!E67","v":0}]
[{"$f":"IF(SUM(F21:F22)>0,\"\",Circuits!$B$6)","v":""},{"$f":"IF(SUM(F21:F22)>0,\"\",Circuits!$C$6)","v":0},{"$f":"Devices!B68","v":0},{"$f":"Devices!C68","v":0},{"$f":"Devices!D68","v":0},{"$f":"Devices!E68","v":0}]
[{"$f":"IF(SUM(F21:F23)>0,\"\",Circuits!$B$6)","v":""},{"$f":"IF(SUM(F21:F23)>0,\"\",Circuits!$C$6)","v":0},{"$f":"Devices!B69","v":0},{"$f":"Devices!C69","v":0},{"$f":"Devices!D69","v":0},{"$f":"Devices!E69","v":0}]
[{"$f":"IF(SUM(F21:F24)>0,\"\",Circuits!$B$6)","v":""},{"$f":"IF(SUM(F21:F24)>0,\"\",Circuits!$C$6)","v":0},{"$f":"Devices!B70","v":0},{"$f":"Devices!C70","v":0},{"$f":"Devices!D70","v":0},{"$f":"Devices!E70","v":0}]
[{"$f":"IF(SUM(F21:F25)>0,\"\",Circuits!$B$6)","v":""},{"$f":"IF(SUM(F21:F25)>0,\"\",Circuits!$C$6)","v":0},{"$f":"Devices!B71","v":0},{"$f":"Devices!C71","v":0},{"$f":"Devices!D71","v":0},{"$f":"Devices!E71","v":0}]
[{"$f":"IF(SUM(F21:F26)>0,\"\",Circuits!$B$6)","v":""},{"$f":"IF(SUM(F21:F26)>0,\"\",Circuits!$C$6)","v":0},{"$f":"Devices!B72","v":0},{"$f":"Devices!C72","v":0},{"$f":"Devices!D72","v":0},{"$f":"Devices!E72","v":0}]
[{"$f":"IF(SUM(F21:F27)>0,\"\",Circuits!$B$6)","v":""},{"$f":"IF(SUM(F21:F27)>0,\"\",Circuits!$C$6)","v":0},{"$f":"Devices!B73","v":0},{"$f":"Devices!C73","v":0},{"$f":"Devices!D73","v":0},{"$f":"Devices!E73","v":0}]
[{"$f":"IF(SUM(F21:F28)>0,\"\",Circuits!$B$6)","v":""},{"$f":"IF(SUM(F21:F28)>0,\"\",Circuits!$C$6)","v":0},{"$f":"Devices!B74","v":0},{"$f":"Devices!C74","v":0},{"$f":"Devices!D74","v":0},{"$f":"Devices!E74","v":0}]
[{"$f":"IF(SUM(F21:F29)>0,\"\",Circuits!$B$6)","v":""},{"$f":"IF(SUM(F21:F29)>0,\"\",Circuits!$C$6)","v":0},{"$f":"Devices!B75","v":0},{"$f":"Devices!C75","v":0},{"$f":"Devices!D75","v":0},{"$f":"Devices!E75","v":0}]
[null,null,null,null,"Total Circuit Current:",{"$f":"Circuits!E6","v":0}]
[]
[{"$f":"Circuits!B7","v":""},{"$f":"Circuits!C7","v":0},{"$f":"Devices!B96","v":0},{"$f":"Devices!C96","v":0},{"$f":"Devices!D96","v":0},{"$f":"Devices!E96","v":0}]
[{"$f":"IF(F33>0,\"\",Circuits!B7)","v":""},{"$f":"IF(F33>0,\"\",Circuits!$C$7)","v":0},{"$f":"Devices!B97","v":0},{"$f":"Devices!C97","v":0},{"$f":"Devices!D97","v":0},{"$f":"Devices!E97","v":0}]
[{"$f":"IF(SUM(F33:F34)>0,\"\",Circuits!$B$7)","v":""},{"$f":"IF(SUM(F33:F34)>0,\"\",Circuits!$C$7)","v":0},{"$f":"Devices!B98","v":0},{"$f":"Devices!C98","v":0},{"$f":"Devices!D98","v":0},{"$f":"Devices!E98","v":0}]
[{"$f":"IF(SUM(F33:F35)>0,\"\",Circuits!$B$7)","v":""},{"$f":"IF(SUM(F33:F35)>0,\"\",Circuits!$C$7)","v":0},{"$f":"Devices!B99","v":0},{"$f":"Devices!C99","v":0},{"$f":"Devices!D99","v":0},{"$f":"Devices!E99","v":0}]
[{"$f":"IF(SUM(F33:F36)>0,\"\",Circuits!$B$7)","v":""},{"$f":"IF(SUM(F33:F36)>0,\"\",Circuits!$C$7)","v":0},{"$f":"Devices!B100","v":0},{"$f":"Devices!C100","v":0},{"$f":"Devices!D100","v":0},{"$f":"Devices!E100","v":0}]
[{"$f":"IF(SUM(F33:F37)>0,\"\",Circuits!$B$7)","v":""},{"$f":"IF(SUM(F33:F37)>0,\"\",Circuits!$C$7)","v":0},{"$f":"Devices!B101","v":0},{"$f":"Devices!C101","v":0},{"$f":"Devices!D101","v":0},{"$f":"Devices!E101","v":0}]
[{"$f":"IF(SUM(F33:F38)>0,\"\",Circuits!$B$7)","v":""},{"$f":"IF(SUM(F33:F38)>0,\"\",Circuits!$C$7)","v":0},{"$f":"Devices!B102","v":0},{"$f":"Devices!C102","v":0},{"$f":"Devices!D102","v":0},{"$f":"Devices!E102","v":0}]
[{"$f":"IF(SUM(F33:F39)>0,\"\",Circuits!$B$7)","v":""},{"$f":"IF(SUM(F33:F39)>0,\"\",Circuits!$C$7)","v":0},{"$f":"Devices!B103","v":0},{"$f":"Devices!C103","v":0},{"$f":"Devices!D103","v":0},{"$f":"Devices!E103","v":0}]
{"$rows_left_out":207}